{"text_format":"2","workbook":"xlsx","n_sheets":2,"sheets":["Sheet1","Sheet2"],"not_rendered":{"charts":0,"images":0,"macros":0,"external_links":3,"defined_names":1,"comments":0,"pivot_tables":0},"unopened":[],"bounds":{"document_bytes":16777216,"sheet_cells":100000,"run_cost":"one","rows_first":2000,"rows_last":500,"rows_between":2000,"halvings":0,"cell_chars":16384,"cell_head_chars":4096},"cells_cut":0,"cells_raw":0,"read":"whole","date_system":"1900"}

{"sheet":"Sheet1","index":0,"n_rows":89,"n_cols":23,"rows_kept":89,"cut":false,"hidden":false,"merged":[]}
["DATA","FURNIZOR","CF","CountryOfOrigin","EXP","DeliveryTermsCode","ACode","Bcode","TransportCode","INVNR","VSCODE","NAME","GROUP","UM","Q","PRICE","NETWEIGHT","NETVEALUE","SUPPL","TOTALVALUE","Curs","CURRVALUE","SYMB"]
[{"$f":"IF([1]Sheet!$E2=\"\",\"\",[1]Sheet!$E2)","v":43865},{"$f":"IF([1]Sheet!$A2=\"\",\"\",[1]Sheet!$A2)","v":"BROTHER INT INDUSTRIEMASCHINEN GMBH"},{"$f":"IF(B2=\"\",\"\",VLOOKUP(B2,[2]Sheet1!$B$2:$C$708,2,0))","v":"DE814895445"},{"$f":"IF(B2=\"\",\"\",VLOOKUP(B2,[2]Sheet1!$B$2:$D$708,3,0))","v":"JP"},{"$f":"IF(B2=\"\",\"\",VLOOKUP(B2,[2]Sheet1!$B$2:$E$708,4,0))","v":"DE"},{"$f":"IF(B2=\"\",\"\",VLOOKUP(B2,[2]Sheet1!$B$2:$F$708,5,0))","v":"EXW"},{"$f":"IF(B2=\"\",\"\",VLOOKUP(B2,[2]Sheet1!$B$2:$G$708,6,0))","v":1},{"$f":"IF(B2=\"\",\"\",VLOOKUP(B2,[2]Sheet1!$B$2:$H$708,7,0))","v":1.1000000000000001},{"$f":"IF(B2=\"\",\"\",VLOOKUP(B2,[2]Sheet1!$B$2:$I$708,8,0))","v":3},null,{"$f":"IF(B2=\"\",\"\",VLOOKUP(L2,[3]Sheet1!$B$2:$J$5000,3,0))","v":"84439990"},{"$f":"IF([1]Sheet!$J2=\"\",\"\",[1]Sheet!$J2)","v":"BROTHER CAP RUBBER"},null,{"$f":"IF(B2=\"\",\"\",VLOOKUP(L2,[3]Sheet1!$B$2:$J$5000,2,0))","v":"BUC"},{"$f":"IF([1]Sheet!$K2=\"\",\"\",[1]Sheet!$K2)","v":20},{"$f":"IF([1]Sheet!$M2=\"\",\"\",[1]Sheet!$M2)","v":19.63},{"$f":"IF(ISNA(IF(B2=\"\",\"\",VLOOKUP(L2,[3]Sheet1!$B$2:$J$5000,9,0)*O2)),0,(IF(B2=\"\",\"\",VLOOKUP(L2,[3]Sheet1!$B$2:$J$5000,9,0)*O2)))","v":0},{"$f":"IF([1]Sheet!$N2=\"\",\"\",[1]Sheet!$N2)","v":392.64}]
[{"$f":"IF([1]Sheet!$E3=\"\",\"\",[1]Sheet!$E3)","v":43887},{"$f":"IF([1]Sheet!$A3=\"\",\"\",[1]Sheet!$A3)","v":"BROTHER INT INDUSTRIEMASCHINEN GMBH"},{"$f":"IF(B3=\"\",\"\",VLOOKUP(B3,[2]Sheet1!$B$2:$C$708,2,0))","v":"DE814895445"},{"$f":"IF(B3=\"\",\"\",VLOOKUP(B3,[2]Sheet1!$B$2:$D$708,3,0))","v":"JP"},{"$f":"IF(B3=\"\",\"\",VLOOKUP(B3,[2]Sheet1!$B$2:$E$708,4,0))","v":"DE"},{"$f":"IF(B3=\"\",\"\",VLOOKUP(B3,[2]Sheet1!$B$2:$F$708,5,0))","v":"EXW"},{"$f":"IF(B3=\"\",\"\",VLOOKUP(B3,[2]Sheet1!$B$2:$G$708,6,0))","v":1},{"$f":"IF(B3=\"\",\"\",VLOOKUP(B3,[2]Sheet1!$B$2:$H$708,7,0))","v":1.1000000000000001},{"$f":"IF(B3=\"\",\"\",VLOOKUP(B3,[2]Sheet1!$B$2:$I$708,8,0))","v":3},null,{"$f":"IF(B3=\"\",\"\",VLOOKUP(L3,[3]Sheet1!$B$2:$J$5000,3,0))","v":"84439990"},{"$f":"IF([1]Sheet!$J3=\"\",\"\",[1]Sheet!$J3)","v":"BROTHER CLEAN STICK R50"},null,{"$f":"IF(B3=\"\",\"\",VLOOKUP(L3,[3]Sheet1!$B$2:$J$5000,2,0))","v":"BUC"},{"$f":"IF([1]Sheet!$K3=\"\",\"\",[1]Sheet!$K3)","v":4},{"$f":"IF([1]Sheet!$M3=\"\",\"\",[1]Sheet!$M3)","v":218.76},{"$f":"IF(ISNA(IF(B3=\"\",\"\",VLOOKUP(L3,[3]Sheet1!$B$2:$J$5000,9,0)*O3)),0,(IF(B3=\"\",\"\",VLOOKUP(L3,[3]Sheet1!$B$2:$J$5000,9,0)*O3)))","v":0},{"$f":"IF([1]Sheet!$N3=\"\",\"\",[1]Sheet!$N3)","v":875.04}]
[{"$f":"IF([1]Sheet!$E4=\"\",\"\",[1]Sheet!$E4)","v":43865},{"$f":"IF([1]Sheet!$A4=\"\",\"\",[1]Sheet!$A4)","v":"BROTHER INT INDUSTRIEMASCHINEN GMBH"},{"$f":"IF(B4=\"\",\"\",VLOOKUP(B4,[2]Sheet1!$B$2:$C$708,2,0))","v":"DE814895445"},{"$f":"IF(B4=\"\",\"\",VLOOKUP(B4,[2]Sheet1!$B$2:$D$708,3,0))","v":"JP"},{"$f":"IF(B4=\"\",\"\",VLOOKUP(B4,[2]Sheet1!$B$2:$E$708,4,0))","v":"DE"},{"$f":"IF(B4=\"\",\"\",VLOOKUP(B4,[2]Sheet1!$B$2:$F$708,5,0))","v":"EXW"},{"$f":"IF(B4=\"\",\"\",VLOOKUP(B4,[2]Sheet1!$B$2:$G$708,6,0))","v":1},{"$f":"IF(B4=\"\",\"\",VLOOKUP(B4,[2]Sheet1!$B$2:$H$708,7,0))","v":1.1000000000000001},{"$f":"IF(B4=\"\",\"\",VLOOKUP(B4,[2]Sheet1!$B$2:$I$708,8,0))","v":3},null,{"$f":"IF(B4=\"\",\"\",VLOOKUP(L4,[3]Sheet1!$B$2:$J$5000,3,0))","v":"84439990"},{"$f":"IF([1]Sheet!$J4=\"\",\"\",[1]Sheet!$J4)","v":"BROTHER FILTER FELT KIT"},null,{"$f":"IF(B4=\"\",\"\",VLOOKUP(L4,[3]Sheet1!$B$2:$J$5000,2,0))","v":"SET"},{"$f":"IF([1]Sheet!$K4=\"\",\"\",[1]Sheet!$K4)","v":10},{"$f":"IF([1]Sheet!$M4=\"\",\"\",[1]Sheet!$M4)","v":84.29},{"$f":"IF(ISNA(IF(B4=\"\",\"\",VLOOKUP(L4,[3]Sheet1!$B$2:$J$5000,9,0)*O4)),0,(IF(B4=\"\",\"\",VLOOKUP(L4,[3]Sheet1!$B$2:$J$5000,9,0)*O4)))","v":0},{"$f":"IF([1]Sheet!$N4=\"\",\"\",[1]Sheet!$N4)","v":842.88}]
[{"$f":"IF([1]Sheet!$E5=\"\",\"\",[1]Sheet!$E5)","v":43887},{"$f":"IF([1]Sheet!$A5=\"\",\"\",[1]Sheet!$A5)","v":"BROTHER INT INDUSTRIEMASCHINEN GMBH"},{"$f":"IF(B5=\"\",\"\",VLOOKUP(B5,[2]Sheet1!$B$2:$C$708,2,0))","v":"DE814895445"},{"$f":"IF(B5=\"\",\"\",VLOOKUP(B5,[2]Sheet1!$B$2:$D$708,3,0))","v":"JP"},{"$f":"IF(B5=\"\",\"\",VLOOKUP(B5,[2]Sheet1!$B$2:$E$708,4,0))","v":"DE"},{"$f":"IF(B5=\"\",\"\",VLOOKUP(B5,[2]Sheet1!$B$2:$F$708,5,0))","v":"EXW"},{"$f":"IF(B5=\"\",\"\",VLOOKUP(B5,[2]Sheet1!$B$2:$G$708,6,0))","v":1},{"$f":"IF(B5=\"\",\"\",VLOOKUP(B5,[2]Sheet1!$B$2:$H$708,7,0))","v":1.1000000000000001},{"$f":"IF(B5=\"\",\"\",VLOOKUP(B5,[2]Sheet1!$B$2:$I$708,8,0))","v":3},null,{"$f":"IF(B5=\"\",\"\",VLOOKUP(L5,[3]Sheet1!$B$2:$J$5000,3,0))","v":"84439990"},{"$f":"IF([1]Sheet!$J5=\"\",\"\",[1]Sheet!$J5)","v":"BROTHER FLASHING FOAM SET"},null,{"$f":"IF(B5=\"\",\"\",VLOOKUP(L5,[3]Sheet1!$B$2:$J$5000,2,0))","v":"BUC"},{"$f":"IF([1]Sheet!$K5=\"\",\"\",[1]Sheet!$K5)","v":10},{"$f":"IF([1]Sheet!$M5=\"\",\"\",[1]Sheet!$M5)","v":63.95},{"$f":"IF(ISNA(IF(B5=\"\",\"\",VLOOKUP(L5,[3]Sheet1!$B$2:$J$5000,9,0)*O5)),0,(IF(B5=\"\",\"\",VLOOKUP(L5,[3]Sheet1!$B$2:$J$5000,9,0)*O5)))","v":0},{"$f":"IF([1]Sheet!$N5=\"\",\"\",[1]Sheet!$N5)","v":639.45000000000005}]
[{"$f":"IF([1]Sheet!$E6=\"\",\"\",[1]Sheet!$E6)","v":43865},{"$f":"IF([1]Sheet!$A6=\"\",\"\",[1]Sheet!$A6)","v":"BROTHER INT INDUSTRIEMASCHINEN GMBH"},{"$f":"IF(B6=\"\",\"\",VLOOKUP(B6,[2]Sheet1!$B$2:$C$708,2,0))","v":"DE814895445"},{"$f":"IF(B6=\"\",\"\",VLOOKUP(B6,[2]Sheet1!$B$2:$D$708,3,0))","v":"JP"},{"$f":"IF(B6=\"\",\"\",VLOOKUP(B6,[2]Sheet1!$B$2:$E$708,4,0))","v":"DE"},{"$f":"IF(B6=\"\",\"\",VLOOKUP(B6,[2]Sheet1!$B$2:$F$708,5,0))","v":"EXW"},{"$f":"IF(B6=\"\",\"\",VLOOKUP(B6,[2]Sheet1!$B$2:$G$708,6,0))","v":1},{"$f":"IF(B6=\"\",\"\",VLOOKUP(B6,[2]Sheet1!$B$2:$H$708,7,0))","v":1.1000000000000001},{"$f":"IF(B6=\"\",\"\",VLOOKUP(B6,[2]Sheet1!$B$2:$I$708,8,0))","v":3},null,{"$f":"IF(B6=\"\",\"\",VLOOKUP(L6,[3]Sheet1!$B$2:$J$5000,3,0))","v":"34022090"},{"$f":"IF([1]Sheet!$J6=\"\",\"\",[1]Sheet!$J6)","v":"BROTHER FULL MAINTENANCE KIT (GT3)"},null,{"$f":"IF(B6=\"\",\"\",VLOOKUP(L6,[3]Sheet1!$B$2:$J$5000,2,0))","v":"SET"},{"$f":"IF([1]Sheet!$K6=\"\",\"\",[1]Sheet!$K6)","v":6},{"$f":"IF([1]Sheet!$M6=\"\",\"\",[1]Sheet!$M6)","v":187.97},{"$f":"IF(ISNA(IF(B6=\"\",\"\",VLOOKUP(L6,[3]Sheet1!$B$2:$J$5000,9,0)*O6)),0,(IF(B6=\"\",\"\",VLOOKUP(L6,[3]Sheet1!$B$2:$J$5000,9,0)*O6)))","v":6},{"$f":"IF([1]Sheet!$N6=\"\",\"\",[1]Sheet!$N6)","v":1127.81}]
[{"$f":"IF([1]Sheet!$E7=\"\",\"\",[1]Sheet!$E7)","v":43887},{"$f":"IF([1]Sheet!$A7=\"\",\"\",[1]Sheet!$A7)","v":"BROTHER INT INDUSTRIEMASCHINEN GMBH"},{"$f":"IF(B7=\"\",\"\",VLOOKUP(B7,[2]Sheet1!$B$2:$C$708,2,0))","v":"DE814895445"},{"$f":"IF(B7=\"\",\"\",VLOOKUP(B7,[2]Sheet1!$B$2:$D$708,3,0))","v":"JP"},{"$f":"IF(B7=\"\",\"\",VLOOKUP(B7,[2]Sheet1!$B$2:$E$708,4,0))","v":"DE"},{"$f":"IF(B7=\"\",\"\",VLOOKUP(B7,[2]Sheet1!$B$2:$F$708,5,0))","v":"EXW"},{"$f":"IF(B7=\"\",\"\",VLOOKUP(B7,[2]Sheet1!$B$2:$G$708,6,0))","v":1},{"$f":"IF(B7=\"\",\"\",VLOOKUP(B7,[2]Sheet1!$B$2:$H$708,7,0))","v":1.1000000000000001},{"$f":"IF(B7=\"\",\"\",VLOOKUP(B7,[2]Sheet1!$B$2:$I$708,8,0))","v":3},null,{"$f":"IF(B7=\"\",\"\",VLOOKUP(L7,[3]Sheet1!$B$2:$J$5000,3,0))","v":"34022090"},{"$f":"IF([1]Sheet!$J7=\"\",\"\",[1]Sheet!$J7)","v":"BROTHER FULL MAINTENANCE KIT (GTX)"},null,{"$f":"IF(B7=\"\",\"\",VLOOKUP(L7,[3]Sheet1!$B$2:$J$5000,2,0))","v":"BUC"},{"$f":"IF([1]Sheet!$K7=\"\",\"\",[1]Sheet!$K7)","v":4},{"$f":"IF([1]Sheet!$M7=\"\",\"\",[1]Sheet!$M7)","v":164.91},{"$f":"IF(ISNA(IF(B7=\"\",\"\",VLOOKUP(L7,[3]Sheet1!$B$2:$J$5000,9,0)*O7)),0,(IF(B7=\"\",\"\",VLOOKUP(L7,[3]Sheet1!$B$2:$J$5000,9,0)*O7)))","v":0},{"$f":"IF([1]Sheet!$N7=\"\",\"\",[1]Sheet!$N7)","v":659.64}]
[{"$f":"IF([1]Sheet!$E8=\"\",\"\",[1]Sheet!$E8)","v":43865},{"$f":"IF([1]Sheet!$A8=\"\",\"\",[1]Sheet!$A8)","v":"BROTHER INT INDUSTRIEMASCHINEN GMBH"},{"$f":"IF(B8=\"\",\"\",VLOOKUP(B8,[2]Sheet1!$B$2:$C$708,2,0))","v":"DE814895445"},{"$f":"IF(B8=\"\",\"\",VLOOKUP(B8,[2]Sheet1!$B$2:$D$708,3,0))","v":"JP"},{"$f":"IF(B8=\"\",\"\",VLOOKUP(B8,[2]Sheet1!$B$2:$E$708,4,0))","v":"DE"},{"$f":"IF(B8=\"\",\"\",VLOOKUP(B8,[2]Sheet1!$B$2:$F$708,5,0))","v":"EXW"},{"$f":"IF(B8=\"\",\"\",VLOOKUP(B8,[2]Sheet1!$B$2:$G$708,6,0))","v":1},{"$f":"IF(B8=\"\",\"\",VLOOKUP(B8,[2]Sheet1!$B$2:$H$708,7,0))","v":1.1000000000000001},{"$f":"IF(B8=\"\",\"\",VLOOKUP(B8,[2]Sheet1!$B$2:$I$708,8,0))","v":3},null,{"$f":"IF(B8=\"\",\"\",VLOOKUP(L8,[3]Sheet1!$B$2:$J$5000,3,0))","v":"29094100"},{"$f":"IF([1]Sheet!$J8=\"\",\"\",[1]Sheet!$J8)","v":"BROTHER GT-3 PRE-TREATMENT (16 L)"},null,{"$f":"IF(B8=\"\",\"\",VLOOKUP(L8,[3]Sheet1!$B$2:$J$5000,2,0))","v":"BUC"},{"$f":"IF([1]Sheet!$K8=\"\",\"\",[1]Sheet!$K8)","v":3},{"$f":"IF([1]Sheet!$M8=\"\",\"\",[1]Sheet!$M8)","v":2140.8000000000002},{"$f":"IF(ISNA(IF(B8=\"\",\"\",VLOOKUP(L8,[3]Sheet1!$B$2:$J$5000,9,0)*O8)),0,(IF(B8=\"\",\"\",VLOOKUP(L8,[3]Sheet1!$B$2:$J$5000,9,0)*O8)))","v":0},{"$f":"IF([1]Sheet!$N8=\"\",\"\",[1]Sheet!$N8)","v":6422.4}]
[{"$f":"IF([1]Sheet!$E9=\"\",\"\",[1]Sheet!$E9)","v":43879},{"$f":"IF([1]Sheet!$A9=\"\",\"\",[1]Sheet!$A9)","v":"BROTHER INT INDUSTRIEMASCHINEN GMBH"},{"$f":"IF(B9=\"\",\"\",VLOOKUP(B9,[2]Sheet1!$B$2:$C$708,2,0))","v":"DE814895445"},{"$f":"IF(B9=\"\",\"\",VLOOKUP(B9,[2]Sheet1!$B$2:$D$708,3,0))","v":"JP"},{"$f":"IF(B9=\"\",\"\",VLOOKUP(B9,[2]Sheet1!$B$2:$E$708,4,0))","v":"DE"},{"$f":"IF(B9=\"\",\"\",VLOOKUP(B9,[2]Sheet1!$B$2:$F$708,5,0))","v":"EXW"},{"$f":"IF(B9=\"\",\"\",VLOOKUP(B9,[2]Sheet1!$B$2:$G$708,6,0))","v":1},{"$f":"IF(B9=\"\",\"\",VLOOKUP(B9,[2]Sheet1!$B$2:$H$708,7,0))","v":1.1000000000000001},{"$f":"IF(B9=\"\",\"\",VLOOKUP(B9,[2]Sheet1!$B$2:$I$708,8,0))","v":3},null,{"$f":"IF(B9=\"\",\"\",VLOOKUP(L9,[3]Sheet1!$B$2:$J$5000,3,0))","v":"84433900"},{"$f":"IF([1]Sheet!$J9=\"\",\"\",[1]Sheet!$J9)","v":"BROTHER GT-361 PRINTER"},null,{"$f":"IF(B9=\"\",\"\",VLOOKUP(L9,[3]Sheet1!$B$2:$J$5000,2,0))","v":"BUC"},{"$f":"IF([1]Sheet!$K9=\"\",\"\",[1]Sheet!$K9)","v":3},{"$f":"IF([1]Sheet!$M9=\"\",\"\",[1]Sheet!$M9)","v":29603.759999999998},{"$f":"IF(ISNA(IF(B9=\"\",\"\",VLOOKUP(L9,[3]Sheet1!$B$2:$J$5000,9,0)*O9)),0,(IF(B9=\"\",\"\",VLOOKUP(L9,[3]Sheet1!$B$2:$J$5000,9,0)*O9)))","v":277.5},{"$f":"IF([1]Sheet!$N9=\"\",\"\",[1]Sheet!$N9)","v":88811.28}]
[{"$f":"IF([1]Sheet!$E10=\"\",\"\",[1]Sheet!$E10)","v":43865},{"$f":"IF([1]Sheet!$A10=\"\",\"\",[1]Sheet!$A10)","v":"BROTHER INT INDUSTRIEMASCHINEN GMBH"},{"$f":"IF(B10=\"\",\"\",VLOOKUP(B10,[2]Sheet1!$B$2:$C$708,2,0))","v":"DE814895445"},{"$f":"IF(B10=\"\",\"\",VLOOKUP(B10,[2]Sheet1!$B$2:$D$708,3,0))","v":"JP"},{"$f":"IF(B10=\"\",\"\",VLOOKUP(B10,[2]Sheet1!$B$2:$E$708,4,0))","v":"DE"},{"$f":"IF(B10=\"\",\"\",VLOOKUP(B10,[2]Sheet1!$B$2:$F$708,5,0))","v":"EXW"},{"$f":"IF(B10=\"\",\"\",VLOOKUP(B10,[2]Sheet1!$B$2:$G$708,6,0))","v":1},{"$f":"IF(B10=\"\",\"\",VLOOKUP(B10,[2]Sheet1!$B$2:$H$708,7,0))","v":1.1000000000000001},{"$f":"IF(B10=\"\",\"\",VLOOKUP(B10,[2]Sheet1!$B$2:$I$708,8,0))","v":3},null,{"$f":"IF(B10=\"\",\"\",VLOOKUP(L10,[3]Sheet1!$B$2:$J$5000,3,0))","v":"34022090"},{"$f":"IF([1]Sheet!$J10=\"\",\"\",[1]Sheet!$J10)","v":"BROTHER GTX CLEANING SOL GCX-4E02"},null,{"$f":"IF(B10=\"\",\"\",VLOOKUP(L10,[3]Sheet1!$B$2:$J$5000,2,0))","v":"BUC"},{"$f":"IF([1]Sheet!$K10=\"\",\"\",[1]Sheet!$K10)","v":6},{"$f":"IF([1]Sheet!$M10=\"\",\"\",[1]Sheet!$M10)","v":264.95999999999998},{"$f":"IF(ISNA(IF(B10=\"\",\"\",VLOOKUP(L10,[3]Sheet1!$B$2:$J$5000,9,0)*O10)),0,(IF(B10=\"\",\"\",VLOOKUP(L10,[3]Sheet1!$B$2:$J$5000,9,0)*O10)))","v":24.599999999999998},{"$f":"IF([1]Sheet!$N10=\"\",\"\",[1]Sheet!$N10)","v":1589.76}]
[{"$f":"IF([1]Sheet!$E11=\"\",\"\",[1]Sheet!$E11)","v":43865},{"$f":"IF([1]Sheet!$A11=\"\",\"\",[1]Sheet!$A11)","v":"BROTHER INT INDUSTRIEMASCHINEN GMBH"},{"$f":"IF(B11=\"\",\"\",VLOOKUP(B11,[2]Sheet1!$B$2:$C$708,2,0))","v":"DE814895445"},{"$f":"IF(B11=\"\",\"\",VLOOKUP(B11,[2]Sheet1!$B$2:$D$708,3,0))","v":"JP"},{"$f":"IF(B11=\"\",\"\",VLOOKUP(B11,[2]Sheet1!$B$2:$E$708,4,0))","v":"DE"},{"$f":"IF(B11=\"\",\"\",VLOOKUP(B11,[2]Sheet1!$B$2:$F$708,5,0))","v":"EXW"},{"$f":"IF(B11=\"\",\"\",VLOOKUP(B11,[2]Sheet1!$B$2:$G$708,6,0))","v":1},{"$f":"IF(B11=\"\",\"\",VLOOKUP(B11,[2]Sheet1!$B$2:$H$708,7,0))","v":1.1000000000000001},{"$f":"IF(B11=\"\",\"\",VLOOKUP(B11,[2]Sheet1!$B$2:$I$708,8,0))","v":3},null,{"$f":"IF(B11=\"\",\"\",VLOOKUP(L11,[3]Sheet1!$B$2:$J$5000,3,0))","v":"32151900"},{"$f":"IF([1]Sheet!$J11=\"\",\"\",[1]Sheet!$J11)","v":"BROTHER GTX INK GCX-4C70 CYAN 700cc"},null,{"$f":"IF(B11=\"\",\"\",VLOOKUP(L11,[3]Sheet1!$B$2:$J$5000,2,0))","v":"BUC"},{"$f":"IF([1]Sheet!$K11=\"\",\"\",[1]Sheet!$K11)","v":4},{"$f":"IF([1]Sheet!$M11=\"\",\"\",[1]Sheet!$M11)","v":668.64},{"$f":"IF(ISNA(IF(B11=\"\",\"\",VLOOKUP(L11,[3]Sheet1!$B$2:$J$5000,9,0)*O11)),0,(IF(B11=\"\",\"\",VLOOKUP(L11,[3]Sheet1!$B$2:$J$5000,9,0)*O11)))","v":4.2},{"$f":"IF([1]Sheet!$N11=\"\",\"\",[1]Sheet!$N11)","v":2674.56}]
[{"$f":"IF([1]Sheet!$E12=\"\",\"\",[1]Sheet!$E12)","v":43865},{"$f":"IF([1]Sheet!$A12=\"\",\"\",[1]Sheet!$A12)","v":"BROTHER INT INDUSTRIEMASCHINEN GMBH"},{"$f":"IF(B12=\"\",\"\",VLOOKUP(B12,[2]Sheet1!$B$2:$C$708,2,0))","v":"DE814895445"},{"$f":"IF(B12=\"\",\"\",VLOOKUP(B12,[2]Sheet1!$B$2:$D$708,3,0))","v":"JP"},{"$f":"IF(B12=\"\",\"\",VLOOKUP(B12,[2]Sheet1!$B$2:$E$708,4,0))","v":"DE"},{"$f":"IF(B12=\"\",\"\",VLOOKUP(B12,[2]Sheet1!$B$2:$F$708,5,0))","v":"EXW"},{"$f":"IF(B12=\"\",\"\",VLOOKUP(B12,[2]Sheet1!$B$2:$G$708,6,0))","v":1},{"$f":"IF(B12=\"\",\"\",VLOOKUP(B12,[2]Sheet1!$B$2:$H$708,7,0))","v":1.1000000000000001},{"$f":"IF(B12=\"\",\"\",VLOOKUP(B12,[2]Sheet1!$B$2:$I$708,8,0))","v":3},null,{"$f":"IF(B12=\"\",\"\",VLOOKUP(L12,[3]Sheet1!$B$2:$J$5000,3,0))","v":"32151100"},{"$f":"IF([1]Sheet!$J12=\"\",\"\",[1]Sheet!$J12)","v":"BROTHER GTX INK GCX-4M70 MAGENTA 700cc"},null,{"$f":"IF(B12=\"\",\"\",VLOOKUP(L12,[3]Sheet1!$B$2:$J$5000,2,0))","v":"BUC"},{"$f":"IF([1]Sheet!$K12=\"\",\"\",[1]Sheet!$K12)","v":2},{"$f":"IF([1]Sheet!$M12=\"\",\"\",[1]Sheet!$M12)","v":668.64},{"$f":"IF(ISNA(IF(B12=\"\",\"\",VLOOKUP(L12,[3]Sheet1!$B$2:$J$5000,9,0)*O12)),0,(IF(B12=\"\",\"\",VLOOKUP(L12,[3]Sheet1!$B$2:$J$5000,9,0)*O12)))","v":2.6999999999999997},{"$f":"IF([1]Sheet!$N12=\"\",\"\",[1]Sheet!$N12)","v":1337.28}]
[{"$f":"IF([1]Sheet!$E13=\"\",\"\",[1]Sheet!$E13)","v":43865},{"$f":"IF([1]Sheet!$A13=\"\",\"\",[1]Sheet!$A13)","v":"BROTHER INT INDUSTRIEMASCHINEN GMBH"},{"$f":"IF(B13=\"\",\"\",VLOOKUP(B13,[2]Sheet1!$B$2:$C$708,2,0))","v":"DE814895445"},{"$f":"IF(B13=\"\",\"\",VLOOKUP(B13,[2]Sheet1!$B$2:$D$708,3,0))","v":"JP"},{"$f":"IF(B13=\"\",\"\",VLOOKUP(B13,[2]Sheet1!$B$2:$E$708,4,0))","v":"DE"},{"$f":"IF(B13=\"\",\"\",VLOOKUP(B13,[2]Sheet1!$B$2:$F$708,5,0))","v":"EXW"},{"$f":"IF(B13=\"\",\"\",VLOOKUP(B13,[2]Sheet1!$B$2:$G$708,6,0))","v":1},{"$f":"IF(B13=\"\",\"\",VLOOKUP(B13,[2]Sheet1!$B$2:$H$708,7,0))","v":1.1000000000000001},{"$f":"IF(B13=\"\",\"\",VLOOKUP(B13,[2]Sheet1!$B$2:$I$708,8,0))","v":3},null,{"$f":"IF(B13=\"\",\"\",VLOOKUP(L13,[3]Sheet1!$B$2:$J$5000,3,0))","v":"32151900"},{"$f":"IF([1]Sheet!$J13=\"\",\"\",[1]Sheet!$J13)","v":"BROTHER GTX INK GCX-4W70 WHITE (2 x 700cc)"},null,{"$f":"IF(B13=\"\",\"\",VLOOKUP(L13,[3]Sheet1!$B$2:$J$5000,2,0))","v":"BUC"},{"$f":"IF([1]Sheet!$K13=\"\",\"\",[1]Sheet!$K13)","v":6},{"$f":"IF([1]Sheet!$M13=\"\",\"\",[1]Sheet!$M13)","v":1176},{"$f":"IF(ISNA(IF(B13=\"\",\"\",VLOOKUP(L13,[3]Sheet1!$B$2:$J$5000,9,0)*O13)),0,(IF(B13=\"\",\"\",VLOOKUP(L13,[3]Sheet1!$B$2:$J$5000,9,0)*O13)))","v":17.399999999999999},{"$f":"IF([1]Sheet!$N13=\"\",\"\",[1]Sheet!$N13)","v":7056}]
[{"$f":"IF([1]Sheet!$E14=\"\",\"\",[1]Sheet!$E14)","v":43887},{"$f":"IF([1]Sheet!$A14=\"\",\"\",[1]Sheet!$A14)","v":"BROTHER INT INDUSTRIEMASCHINEN GMBH"},{"$f":"IF(B14=\"\",\"\",VLOOKUP(B14,[2]Sheet1!$B$2:$C$708,2,0))","v":"DE814895445"},{"$f":"IF(B14=\"\",\"\",VLOOKUP(B14,[2]Sheet1!$B$2:$D$708,3,0))","v":"JP"},{"$f":"IF(B14=\"\",\"\",VLOOKUP(B14,[2]Sheet1!$B$2:$E$708,4,0))","v":"DE"},{"$f":"IF(B14=\"\",\"\",VLOOKUP(B14,[2]Sheet1!$B$2:$F$708,5,0))","v":"EXW"},{"$f":"IF(B14=\"\",\"\",VLOOKUP(B14,[2]Sheet1!$B$2:$G$708,6,0))","v":1},{"$f":"IF(B14=\"\",\"\",VLOOKUP(B14,[2]Sheet1!$B$2:$H$708,7,0))","v":1.1000000000000001},{"$f":"IF(B14=\"\",\"\",VLOOKUP(B14,[2]Sheet1!$B$2:$I$708,8,0))","v":3},null,{"$f":"IF(B14=\"\",\"\",VLOOKUP(L14,[3]Sheet1!$B$2:$J$5000,3,0))","v":"32151900"},{"$f":"IF([1]Sheet!$J14=\"\",\"\",[1]Sheet!$J14)","v":"BROTHER GTX INK GCX-4W70 WHITE (2 x 700cc)"},null,{"$f":"IF(B14=\"\",\"\",VLOOKUP(L14,[3]Sheet1!$B$2:$J$5000,2,0))","v":"BUC"},{"$f":"IF([1]Sheet!$K14=\"\",\"\",[1]Sheet!$K14)","v":30},{"$f":"IF([1]Sheet!$M14=\"\",\"\",[1]Sheet!$M14)","v":1119.9000000000001},{"$f":"IF(ISNA(IF(B14=\"\",\"\",VLOOKUP(L14,[3]Sheet1!$B$2:$J$5000,9,0)*O14)),0,(IF(B14=\"\",\"\",VLOOKUP(L14,[3]Sheet1!$B$2:$J$5000,9,0)*O14)))","v":87},{"$f":"IF([1]Sheet!$N14=\"\",\"\",[1]Sheet!$N14)","v":33597.120000000003}]
[{"$f":"IF([1]Sheet!$E15=\"\",\"\",[1]Sheet!$E15)","v":43887},{"$f":"IF([1]Sheet!$A15=\"\",\"\",[1]Sheet!$A15)","v":"BROTHER INT INDUSTRIEMASCHINEN GMBH"},{"$f":"IF(B15=\"\",\"\",VLOOKUP(B15,[2]Sheet1!$B$2:$C$708,2,0))","v":"DE814895445"},{"$f":"IF(B15=\"\",\"\",VLOOKUP(B15,[2]Sheet1!$B$2:$D$708,3,0))","v":"JP"},{"$f":"IF(B15=\"\",\"\",VLOOKUP(B15,[2]Sheet1!$B$2:$E$708,4,0))","v":"DE"},{"$f":"IF(B15=\"\",\"\",VLOOKUP(B15,[2]Sheet1!$B$2:$F$708,5,0))","v":"EXW"},{"$f":"IF(B15=\"\",\"\",VLOOKUP(B15,[2]Sheet1!$B$2:$G$708,6,0))","v":1},{"$f":"IF(B15=\"\",\"\",VLOOKUP(B15,[2]Sheet1!$B$2:$H$708,7,0))","v":1.1000000000000001},{"$f":"IF(B15=\"\",\"\",VLOOKUP(B15,[2]Sheet1!$B$2:$I$708,8,0))","v":3},null,{"$f":"IF(B15=\"\",\"\",VLOOKUP(L15,[3]Sheet1!$B$2:$J$5000,3,0))","v":"32151100"},{"$f":"IF([1]Sheet!$J15=\"\",\"\",[1]Sheet!$J15)","v":"BROTHER GTX INK GCX-4Y70 YELLOW 700cc"},null,{"$f":"IF(B15=\"\",\"\",VLOOKUP(L15,[3]Sheet1!$B$2:$J$5000,2,0))","v":"BUC"},{"$f":"IF([1]Sheet!$K15=\"\",\"\",[1]Sheet!$K15)","v":2},{"$f":"IF([1]Sheet!$M15=\"\",\"\",[1]Sheet!$M15)","v":669.74},{"$f":"IF(ISNA(IF(B15=\"\",\"\",VLOOKUP(L15,[3]Sheet1!$B$2:$J$5000,9,0)*O15)),0,(IF(B15=\"\",\"\",VLOOKUP(L15,[3]Sheet1!$B$2:$J$5000,9,0)*O15)))","v":2.6999999999999997},{"$f":"IF([1]Sheet!$N15=\"\",\"\",[1]Sheet!$N15)","v":1339.48}]
[{"$f":"IF([1]Sheet!$E16=\"\",\"\",[1]Sheet!$E16)","v":43865},{"$f":"IF([1]Sheet!$A16=\"\",\"\",[1]Sheet!$A16)","v":"BROTHER INT INDUSTRIEMASCHINEN GMBH"},{"$f":"IF(B16=\"\",\"\",VLOOKUP(B16,[2]Sheet1!$B$2:$C$708,2,0))","v":"DE814895445"},{"$f":"IF(B16=\"\",\"\",VLOOKUP(B16,[2]Sheet1!$B$2:$D$708,3,0))","v":"JP"},{"$f":"IF(B16=\"\",\"\",VLOOKUP(B16,[2]Sheet1!$B$2:$E$708,4,0))","v":"DE"},{"$f":"IF(B16=\"\",\"\",VLOOKUP(B16,[2]Sheet1!$B$2:$F$708,5,0))","v":"EXW"},{"$f":"IF(B16=\"\",\"\",VLOOKUP(B16,[2]Sheet1!$B$2:$G$708,6,0))","v":1},{"$f":"IF(B16=\"\",\"\",VLOOKUP(B16,[2]Sheet1!$B$2:$H$708,7,0))","v":1.1000000000000001},{"$f":"IF(B16=\"\",\"\",VLOOKUP(B16,[2]Sheet1!$B$2:$I$708,8,0))","v":3},null,{"$f":"IF(B16=\"\",\"\",VLOOKUP(L16,[3]Sheet1!$B$2:$J$5000,3,0))","v":"34022090"},{"$f":"IF([1]Sheet!$J16=\"\",\"\",[1]Sheet!$J16)","v":"BROTHER MAINTENANCE SOL 5L"},null,{"$f":"IF(B16=\"\",\"\",VLOOKUP(L16,[3]Sheet1!$B$2:$J$5000,2,0))","v":"BUC"},{"$f":"IF([1]Sheet!$K16=\"\",\"\",[1]Sheet!$K16)","v":4},{"$f":"IF([1]Sheet!$M16=\"\",\"\",[1]Sheet!$M16)","v":391.68},{"$f":"IF(ISNA(IF(B16=\"\",\"\",VLOOKUP(L16,[3]Sheet1!$B$2:$J$5000,9,0)*O16)),0,(IF(B16=\"\",\"\",VLOOKUP(L16,[3]Sheet1!$B$2:$J$5000,9,0)*O16)))","v":15.520000000000001},{"$f":"IF([1]Sheet!$N16=\"\",\"\",[1]Sheet!$N16)","v":1566.72}]
[{"$f":"IF([1]Sheet!$E17=\"\",\"\",[1]Sheet!$E17)","v":43865},{"$f":"IF([1]Sheet!$A17=\"\",\"\",[1]Sheet!$A17)","v":"BROTHER INT INDUSTRIEMASCHINEN GMBH"},{"$f":"IF(B17=\"\",\"\",VLOOKUP(B17,[2]Sheet1!$B$2:$C$708,2,0))","v":"DE814895445"},{"$f":"IF(B17=\"\",\"\",VLOOKUP(B17,[2]Sheet1!$B$2:$D$708,3,0))","v":"JP"},{"$f":"IF(B17=\"\",\"\",VLOOKUP(B17,[2]Sheet1!$B$2:$E$708,4,0))","v":"DE"},{"$f":"IF(B17=\"\",\"\",VLOOKUP(B17,[2]Sheet1!$B$2:$F$708,5,0))","v":"EXW"},{"$f":"IF(B17=\"\",\"\",VLOOKUP(B17,[2]Sheet1!$B$2:$G$708,6,0))","v":1},{"$f":"IF(B17=\"\",\"\",VLOOKUP(B17,[2]Sheet1!$B$2:$H$708,7,0))","v":1.1000000000000001},{"$f":"IF(B17=\"\",\"\",VLOOKUP(B17,[2]Sheet1!$B$2:$I$708,8,0))","v":3},null,{"$f":"IF(B17=\"\",\"\",VLOOKUP(L17,[3]Sheet1!$B$2:$J$5000,3,0))","v":"84439990"},{"$f":"IF([1]Sheet!$J17=\"\",\"\",[1]Sheet!$J17)","v":"BROTHER PRINT HEAD IH2DS GT-3"},null,{"$f":"IF(B17=\"\",\"\",VLOOKUP(L17,[3]Sheet1!$B$2:$J$5000,2,0))","v":"BUC"},{"$f":"IF([1]Sheet!$K17=\"\",\"\",[1]Sheet!$K17)","v":2},{"$f":"IF([1]Sheet!$M17=\"\",\"\",[1]Sheet!$M17)","v":3192},{"$f":"IF(ISNA(IF(B17=\"\",\"\",VLOOKUP(L17,[3]Sheet1!$B$2:$J$5000,9,0)*O17)),0,(IF(B17=\"\",\"\",VLOOKUP(L17,[3]Sheet1!$B$2:$J$5000,9,0)*O17)))","v":0},{"$f":"IF([1]Sheet!$N17=\"\",\"\",[1]Sheet!$N17)","v":6384}]
[{"$f":"IF([1]Sheet!$E18=\"\",\"\",[1]Sheet!$E18)","v":43887},{"$f":"IF([1]Sheet!$A18=\"\",\"\",[1]Sheet!$A18)","v":"BROTHER INT INDUSTRIEMASCHINEN GMBH"},{"$f":"IF(B18=\"\",\"\",VLOOKUP(B18,[2]Sheet1!$B$2:$C$708,2,0))","v":"DE814895445"},{"$f":"IF(B18=\"\",\"\",VLOOKUP(B18,[2]Sheet1!$B$2:$D$708,3,0))","v":"JP"},{"$f":"IF(B18=\"\",\"\",VLOOKUP(B18,[2]Sheet1!$B$2:$E$708,4,0))","v":"DE"},{"$f":"IF(B18=\"\",\"\",VLOOKUP(B18,[2]Sheet1!$B$2:$F$708,5,0))","v":"EXW"},{"$f":"IF(B18=\"\",\"\",VLOOKUP(B18,[2]Sheet1!$B$2:$G$708,6,0))","v":1},{"$f":"IF(B18=\"\",\"\",VLOOKUP(B18,[2]Sheet1!$B$2:$H$708,7,0))","v":1.1000000000000001},{"$f":"IF(B18=\"\",\"\",VLOOKUP(B18,[2]Sheet1!$B$2:$I$708,8,0))","v":3},null,{"$f":"IF(B18=\"\",\"\",VLOOKUP(L18,[3]Sheet1!$B$2:$J$5000,3,0))","v":"84439990"},{"$f":"IF([1]Sheet!$J18=\"\",\"\",[1]Sheet!$J18)","v":"BROTHER PRINT HEAD IH2DS GT-3"},null,{"$f":"IF(B18=\"\",\"\",VLOOKUP(L18,[3]Sheet1!$B$2:$J$5000,2,0))","v":"BUC"},{"$f":"IF([1]Sheet!$K18=\"\",\"\",[1]Sheet!$K18)","v":2},{"$f":"IF([1]Sheet!$M18=\"\",\"\",[1]Sheet!$M18)","v":3197.25},{"$f":"IF(ISNA(IF(B18=\"\",\"\",VLOOKUP(L18,[3]Sheet1!$B$2:$J$5000,9,0)*O18)),0,(IF(B18=\"\",\"\",VLOOKUP(L18,[3]Sheet1!$B$2:$J$5000,9,0)*O18)))","v":0},{"$f":"IF([1]Sheet!$N18=\"\",\"\",[1]Sheet!$N18)","v":6394.51}]
[{"$f":"IF([1]Sheet!$E19=\"\",\"\",[1]Sheet!$E19)","v":43887},{"$f":"IF([1]Sheet!$A19=\"\",\"\",[1]Sheet!$A19)","v":"BROTHER INT INDUSTRIEMASCHINEN GMBH"},{"$f":"IF(B19=\"\",\"\",VLOOKUP(B19,[2]Sheet1!$B$2:$C$708,2,0))","v":"DE814895445"},{"$f":"IF(B19=\"\",\"\",VLOOKUP(B19,[2]Sheet1!$B$2:$D$708,3,0))","v":"JP"},{"$f":"IF(B19=\"\",\"\",VLOOKUP(B19,[2]Sheet1!$B$2:$E$708,4,0))","v":"DE"},{"$f":"IF(B19=\"\",\"\",VLOOKUP(B19,[2]Sheet1!$B$2:$F$708,5,0))","v":"EXW"},{"$f":"IF(B19=\"\",\"\",VLOOKUP(B19,[2]Sheet1!$B$2:$G$708,6,0))","v":1},{"$f":"IF(B19=\"\",\"\",VLOOKUP(B19,[2]Sheet1!$B$2:$H$708,7,0))","v":1.1000000000000001},{"$f":"IF(B19=\"\",\"\",VLOOKUP(B19,[2]Sheet1!$B$2:$I$708,8,0))","v":3},null,{"$f":"IF(B19=\"\",\"\",VLOOKUP(L19,[3]Sheet1!$B$2:$J$5000,3,0))","v":"84439990"},{"$f":"IF([1]Sheet!$J19=\"\",\"\",[1]Sheet!$J19)","v":"BROTHER SCH-807067 TEFLON SLIDER"},null,{"$f":"IF(B19=\"\",\"\",VLOOKUP(L19,[3]Sheet1!$B$2:$J$5000,2,0))","v":"BUC"},{"$f":"IF([1]Sheet!$K19=\"\",\"\",[1]Sheet!$K19)","v":4},{"$f":"IF([1]Sheet!$M19=\"\",\"\",[1]Sheet!$M19)","v":59.62},{"$f":"IF(ISNA(IF(B19=\"\",\"\",VLOOKUP(L19,[3]Sheet1!$B$2:$J$5000,9,0)*O19)),0,(IF(B19=\"\",\"\",VLOOKUP(L19,[3]Sheet1!$B$2:$J$5000,9,0)*O19)))","v":0},{"$f":"IF([1]Sheet!$N19=\"\",\"\",[1]Sheet!$N19)","v":238.47}]
[{"$f":"IF([1]Sheet!$E20=\"\",\"\",[1]Sheet!$E20)","v":43887},{"$f":"IF([1]Sheet!$A20=\"\",\"\",[1]Sheet!$A20)","v":"BROTHER INT INDUSTRIEMASCHINEN GMBH"},{"$f":"IF(B20=\"\",\"\",VLOOKUP(B20,[2]Sheet1!$B$2:$C$708,2,0))","v":"DE814895445"},{"$f":"IF(B20=\"\",\"\",VLOOKUP(B20,[2]Sheet1!$B$2:$D$708,3,0))","v":"JP"},{"$f":"IF(B20=\"\",\"\",VLOOKUP(B20,[2]Sheet1!$B$2:$E$708,4,0))","v":"DE"},{"$f":"IF(B20=\"\",\"\",VLOOKUP(B20,[2]Sheet1!$B$2:$F$708,5,0))","v":"EXW"},{"$f":"IF(B20=\"\",\"\",VLOOKUP(B20,[2]Sheet1!$B$2:$G$708,6,0))","v":1},{"$f":"IF(B20=\"\",\"\",VLOOKUP(B20,[2]Sheet1!$B$2:$H$708,7,0))","v":1.1000000000000001},{"$f":"IF(B20=\"\",\"\",VLOOKUP(B20,[2]Sheet1!$B$2:$I$708,8,0))","v":3},null,{"$f":"IF(B20=\"\",\"\",VLOOKUP(L20,[3]Sheet1!$B$2:$J$5000,3,0))","v":"84439990"},{"$f":"IF([1]Sheet!$J20=\"\",\"\",[1]Sheet!$J20)","v":"BROTHER WIPER CLEANER (2 Pcs)"},null,{"$f":"IF(B20=\"\",\"\",VLOOKUP(L20,[3]Sheet1!$B$2:$J$5000,2,0))","v":"BUC"},{"$f":"IF([1]Sheet!$K20=\"\",\"\",[1]Sheet!$K20)","v":4},{"$f":"IF([1]Sheet!$M20=\"\",\"\",[1]Sheet!$M20)","v":55.53},{"$f":"IF(ISNA(IF(B20=\"\",\"\",VLOOKUP(L20,[3]Sheet1!$B$2:$J$5000,9,0)*O20)),0,(IF(B20=\"\",\"\",VLOOKUP(L20,[3]Sheet1!$B$2:$J$5000,9,0)*O20)))","v":0},{"$f":"IF([1]Sheet!$N20=\"\",\"\",[1]Sheet!$N20)","v":222.12}]
{"$rows_left_out":70}
{"sheet":"Sheet2","index":1,"n_rows":1,"n_cols":1,"rows_kept":1,"cut":false,"hidden":false,"merged":[]}
[{"$f":"COUNTA([1]Sheet!$A$2:A992)","v":88}]